| 會員 ![]() | 【求助】cyrus-sasl2安裝出現錯誤問題 作業系統FC4,我想做postfix+sasl2的認證,在make時出現下列錯誤訊息 [root@server cyrus-sasl-2.1.21]#./configure --prefix=/usr/local/cyrus-sasl2 --enable-login --enable-plain [root@server cyrus-sasl-2.1.21]#make ------------- .....省略 gcc -DHAVE_CONFIG_H -I. -I. -I.. -I../include -I../plugins -I../include -I../sasldb -Wall -W -g -O2 -MT client.lo -MD -MP -MF .deps/client.Tpo -c client.c -fPIC -DPIC -o client.lo client.c:64: error: static declaration of 'global_callbacks' follows non-static declaration saslint.h:112: error: previous declaration of 'global_callbacks' was here client.c: In function '_sasl_print_mechanism': client.c:863: warning: unused parameter 'rock' make[2]: *** [client.lo] Error 1 make[2]: Leaving directory `/usr/local/src/cyrus-sasl-2.1.21/lib' make[1]: *** [all-recursive] Error 1 make[1]: Leaving directory `/usr/local/src/cyrus-sasl-2.1.21' make: *** [all] Error 2 [root@server cyrus-sasl-2.1.21]# ---------------- 請問各位是否有人遇到同樣的問題呢? 看/var/log/messages檔案也沒有記載相關錯誤訊息 |
| 回覆 |
| 會員 ![]() | 後來我又在裝一台FC3來安裝,結果竟然可以安裝成功,實在是不知道是什麼問題,怪了 |
| 回覆 |
| |
| XML | RSS 2.0 | RSS |
本論壇所有文章僅代表留言者個人意見,並不代表本站之立場,討論區以「即時留言」方式運作,故無法完全監察所有即時留言,若您發現文章可能有異議,請 email :[email protected] 處理。